{"text_format":"1","workbook":"xlsx","n_sheets":12,"sheets":["KanningarRapport","BotnSyni","SyniKanningarfolk","BotnDjor","UrslitSens","UrslitKemi","DjorlivSyni","UrslitDjoraliv","dropdown","talvur","taxonpath","version"],"not_rendered":{"charts":0,"images":1,"macros":1,"external_links":0,"defined_names":48,"comments":0,"pivot_tables":0},"unopened":[],"bounds":{"document_bytes":16777216,"sheet_cells":100000,"rows_first":2000,"rows_last":500,"rows_between":2000,"halvings":0,"cell_chars":16384,"cell_head_chars":4096},"cells_cut":0,"cells_raw":0,"read":"whole","date_system":"1900"}

{"sheet":"KanningarRapport","index":0,"n_rows":2,"n_cols":15,"rows_kept":2,"cut":false,"hidden":false,"merged":[]}
["rap_id","utgava_navn","alioki_id","utgava_dato","kfelag_id","utgava_slag","alis_utsetuar","alis_tal_vid_kanning","alis_biomassi_vid_kanning","alis_sumvokstur","alis_sumfodur","avgreidsludato","journal_nr","GIStype","rap_vidmerking"]
[{"$f":"C2& \"-\" &TEXT(D2, \"ååmmdd\")","v":"-000100"}]

{"sheet":"BotnSyni","index":1,"n_rows":82,"n_cols":28,"rows_kept":82,"cut":false,"hidden":false,"merged":[]}
["botn_id","stodslag_id","stodnr","synistoku_dato","botnheint_id","grabbavidd_m2","haps_synilongd_cm","plan_lng","plan_lat","lng","lat","dypi","tal_av_royndum","sandur","grus","leirur","mora","steinabotnur","klettur","skeljasandur","steinagrus","silt","evja","okent","alieind","ringur_nr","hfs_ringur","botn_vidmerking"]
[{"$f":"IF(BotnSyni!$B2=\"\",\"\",B2&\"-\"&BotnSyni!$C2)","v":""}]
[{"$f":"IF(BotnSyni!$B3=\"\",\"\",B3&\"-\"&BotnSyni!$C3)","v":""}]
[{"$f":"IF(BotnSyni!$B4=\"\",\"\",B4&\"-\"&BotnSyni!$C4)","v":""}]
[{"$f":"IF(BotnSyni!$B5=\"\",\"\",B5&\"-\"&BotnSyni!$C5)","v":""}]
[{"$f":"IF(BotnSyni!$B6=\"\",\"\",B6&\"-\"&BotnSyni!$C6)","v":""}]
[{"$f":"IF(BotnSyni!$B7=\"\",\"\",B7&\"-\"&BotnSyni!$C7)","v":""}]
[{"$f":"IF(BotnSyni!$B8=\"\",\"\",B8&\"-\"&BotnSyni!$C8)","v":""}]
[{"$f":"IF(BotnSyni!$B9=\"\",\"\",B9&\"-\"&BotnSyni!$C9)","v":""}]
[{"$f":"IF(BotnSyni!$B10=\"\",\"\",B10&\"-\"&BotnSyni!$C10)","v":""}]
[{"$f":"IF(BotnSyni!$B11=\"\",\"\",B11&\"-\"&BotnSyni!$C11)","v":""}]
[{"$f":"IF(BotnSyni!$B12=\"\",\"\",B12&\"-\"&BotnSyni!$C12)","v":""}]
[{"$f":"IF(BotnSyni!$B13=\"\",\"\",B13&\"-\"&BotnSyni!$C13)","v":""}]
[{"$f":"IF(BotnSyni!$B14=\"\",\"\",B14&\"-\"&BotnSyni!$C14)","v":""}]
[{"$f":"IF(BotnSyni!$B15=\"\",\"\",B15&\"-\"&BotnSyni!$C15)","v":""}]
[{"$f":"IF(BotnSyni!$B16=\"\",\"\",B16&\"-\"&BotnSyni!$C16)","v":""}]
[{"$f":"IF(BotnSyni!$B17=\"\",\"\",B17&\"-\"&BotnSyni!$C17)","v":""}]
[{"$f":"IF(BotnSyni!$B18=\"\",\"\",B18&\"-\"&BotnSyni!$C18)","v":""}]
[{"$f":"IF(BotnSyni!$B19=\"\",\"\",B19&\"-\"&BotnSyni!$C19)","v":""}]
[{"$f":"IF(BotnSyni!$B20=\"\",\"\",B20&\"-\"&BotnSyni!$C20)","v":""}]
{"$rows_left_out":63}
{"sheet":"SyniKanningarfolk","index":2,"n_rows":1,"n_cols":3,"rows_kept":1,"cut":false,"hidden":false,"merged":[]}
["botn_id","kfolk_id","synikannfolk_vidmerking"]

{"sheet":"BotnDjor","index":3,"n_rows":1,"n_cols":18,"rows_kept":1,"cut":false,"hidden":false,"merged":[]}
["botn_id","tindadyr","krabbadyr","lindyr","madkar","malacoceros_fuliginosus","capitella_capitata","djor_alikervi","djor_onnur","fodur","skarn","beggiatoa","blodr_spontant","blodr_synistoku","blodr_syni","kann_kemi","kann_djor","bdjor_vidmerking"]

{"sheet":"UrslitSens","index":4,"n_rows":1,"n_cols":23,"rows_kept":1,"cut":false,"hidden":false,"merged":[]}
["botn_id","djor","pH","eh_mata","eh_buffer_standard","eh_buffer_mata","eh_elektrodu_standard","eh_korr","ph_eh_stig","stoda_ii_stig","blodrur","litur","luktur","fastleiki","grabbanogd","evjutjugd","summur","summur_korr","stoda_iii_stig","stoda_iiogiii_mean","stoda_iiogiii_stig","tridhaegst","urslitsens_vidmerking"]

{"sheet":"UrslitKemi","index":5,"n_rows":1,"n_cols":12,"rows_kept":1,"cut":false,"hidden":false,"merged":[]}
["botn_id","evni","virdi","eind","basis","qflag","lod","loq","matiovissa","met_matiovissa","starvsstova","urslitkemi_vidmerking"]

{"sheet":"DjorlivSyni","index":6,"n_rows":41,"n_cols":13,"rows_kept":41,"cut":false,"hidden":false,"merged":[]}
["djorliv_id","botn_id","grabba_nr","uppr_synisnavn","upptalt","botnheint_id","grabbavidd_m2","cm_fra_loki","perc_fullur","fraktion_upptald","lng","lat","dypi"]
[{"$f":"IF(DjorlivSyni!$B2=\"\",\"\",B2&\"-\"&DjorlivSyni!$C2)","v":""}]
[{"$f":"IF(DjorlivSyni!$B3=\"\",\"\",B3&\"-\"&DjorlivSyni!$C3)","v":""}]
[{"$f":"IF(DjorlivSyni!$B4=\"\",\"\",B4&\"-\"&DjorlivSyni!$C4)","v":""}]
[{"$f":"IF(DjorlivSyni!$B5=\"\",\"\",B5&\"-\"&DjorlivSyni!$C5)","v":""}]
[{"$f":"IF(DjorlivSyni!$B6=\"\",\"\",B6&\"-\"&DjorlivSyni!$C6)","v":""}]
[{"$f":"IF(DjorlivSyni!$B7=\"\",\"\",B7&\"-\"&DjorlivSyni!$C7)","v":""}]
[{"$f":"IF(DjorlivSyni!$B8=\"\",\"\",B8&\"-\"&DjorlivSyni!$C8)","v":""}]
[{"$f":"IF(DjorlivSyni!$B9=\"\",\"\",B9&\"-\"&DjorlivSyni!$C9)","v":""}]
[{"$f":"IF(DjorlivSyni!$B10=\"\",\"\",B10&\"-\"&DjorlivSyni!$C10)","v":""}]
[{"$f":"IF(DjorlivSyni!$B11=\"\",\"\",B11&\"-\"&DjorlivSyni!$C11)","v":""}]
[{"$f":"IF(DjorlivSyni!$B12=\"\",\"\",B12&\"-\"&DjorlivSyni!$C12)","v":""}]
[{"$f":"IF(DjorlivSyni!$B13=\"\",\"\",B13&\"-\"&DjorlivSyni!$C13)","v":""}]
[{"$f":"IF(DjorlivSyni!$B14=\"\",\"\",B14&\"-\"&DjorlivSyni!$C14)","v":""}]
[{"$f":"IF(DjorlivSyni!$B15=\"\",\"\",B15&\"-\"&DjorlivSyni!$C15)","v":""}]
[{"$f":"IF(DjorlivSyni!$B16=\"\",\"\",B16&\"-\"&DjorlivSyni!$C16)","v":""}]
[{"$f":"IF(DjorlivSyni!$B17=\"\",\"\",B17&\"-\"&DjorlivSyni!$C17)","v":""}]
[{"$f":"IF(DjorlivSyni!$B18=\"\",\"\",B18&\"-\"&DjorlivSyni!$C18)","v":""}]
[{"$f":"IF(DjorlivSyni!$B19=\"\",\"\",B19&\"-\"&DjorlivSyni!$C19)","v":""}]
[{"$f":"IF(DjorlivSyni!$B20=\"\",\"\",B20&\"-\"&DjorlivSyni!$C20)","v":""}]
{"$rows_left_out":22}
{"sheet":"UrslitDjoraliv","index":7,"n_rows":366,"n_cols":4,"rows_kept":366,"cut":false,"hidden":false,"merged":[]}
["aphia_id_auto","scientific_name","aphia_id_manuelt","djoraliv_vidmerking"]
[{"$f":"IF(B2=\"\",\"\",IF(_xlfn.IFNA(MATCH(B2,taxonpath[scientific_name],0),\"\")=\"\",\"\",LOOKUP(B2,taxonpath[scientific_name],taxonpath[aphia_id])))","v":""}]
[{"$f":"IF(B3=\"\",\"\",IF(_xlfn.IFNA(MATCH(B3,taxonpath[scientific_name],0),\"\")=\"\",\"\",LOOKUP(B3,taxonpath[scientific_name],taxonpath[aphia_id])))","v":""}]
[{"$f":"IF(B4=\"\",\"\",IF(_xlfn.IFNA(MATCH(B4,taxonpath[scientific_name],0),\"\")=\"\",\"\",LOOKUP(B4,taxonpath[scientific_name],taxonpath[aphia_id])))","v":""}]
[{"$f":"IF(B5=\"\",\"\",IF(_xlfn.IFNA(MATCH(B5,taxonpath[scientific_name],0),\"\")=\"\",\"\",LOOKUP(B5,taxonpath[scientific_name],taxonpath[aphia_id])))","v":""}]
[{"$f":"IF(B6=\"\",\"\",IF(_xlfn.IFNA(MATCH(B6,taxonpath[scientific_name],0),\"\")=\"\",\"\",LOOKUP(B6,taxonpath[scientific_name],taxonpath[aphia_id])))","v":""}]
[{"$f":"IF(B7=\"\",\"\",IF(_xlfn.IFNA(MATCH(B7,taxonpath[scientific_name],0),\"\")=\"\",\"\",LOOKUP(B7,taxonpath[scientific_name],taxonpath[aphia_id])))","v":""}]
[{"$f":"IF(B8=\"\",\"\",IF(_xlfn.IFNA(MATCH(B8,taxonpath[scientific_name],0),\"\")=\"\",\"\",LOOKUP(B8,taxonpath[scientific_name],taxonpath[aphia_id])))","v":""}]
[{"$f":"IF(B9=\"\",\"\",IF(_xlfn.IFNA(MATCH(B9,taxonpath[scientific_name],0),\"\")=\"\",\"\",LOOKUP(B9,taxonpath[scientific_name],taxonpath[aphia_id])))","v":""}]
[{"$f":"IF(B10=\"\",\"\",IF(_xlfn.IFNA(MATCH(B10,taxonpath[scientific_name],0),\"\")=\"\",\"\",LOOKUP(B10,taxonpath[scientific_name],taxonpath[aphia_id])))","v":""}]
[{"$f":"IF(B11=\"\",\"\",IF(_xlfn.IFNA(MATCH(B11,taxonpath[scientific_name],0),\"\")=\"\",\"\",LOOKUP(B11,taxonpath[scientific_name],taxonpath[aphia_id])))","v":""}]
[{"$f":"IF(B12=\"\",\"\",IF(_xlfn.IFNA(MATCH(B12,taxonpath[scientific_name],0),\"\")=\"\",\"\",LOOKUP(B12,taxonpath[scientific_name],taxonpath[aphia_id])))","v":""}]
[{"$f":"IF(B13=\"\",\"\",IF(_xlfn.IFNA(MATCH(B13,taxonpath[scientific_name],0),\"\")=\"\",\"\",LOOKUP(B13,taxonpath[scientific_name],taxonpath[aphia_id])))","v":""}]
[{"$f":"IF(B14=\"\",\"\",IF(_xlfn.IFNA(MATCH(B14,taxonpath[scientific_name],0),\"\")=\"\",\"\",LOOKUP(B14,taxonpath[scientific_name],taxonpath[aphia_id])))","v":""}]
[{"$f":"IF(B15=\"\",\"\",IF(_xlfn.IFNA(MATCH(B15,taxonpath[scientific_name],0),\"\")=\"\",\"\",LOOKUP(B15,taxonpath[scientific_name],taxonpath[aphia_id])))","v":""}]
[{"$f":"IF(B16=\"\",\"\",IF(_xlfn.IFNA(MATCH(B16,taxonpath[scientific_name],0),\"\")=\"\",\"\",LOOKUP(B16,taxonpath[scientific_name],taxonpath[aphia_id])))","v":""}]
[{"$f":"IF(B17=\"\",\"\",IF(_xlfn.IFNA(MATCH(B17,taxonpath[scientific_name],0),\"\")=\"\",\"\",LOOKUP(B17,taxonpath[scientific_name],taxonpath[aphia_id])))","v":""}]
[{"$f":"IF(B18=\"\",\"\",IF(_xlfn.IFNA(MATCH(B18,taxonpath[scientific_name],0),\"\")=\"\",\"\",LOOKUP(B18,taxonpath[scientific_name],taxonpath[aphia_id])))","v":""}]
[{"$f":"IF(B19=\"\",\"\",IF(_xlfn.IFNA(MATCH(B19,taxonpath[scientific_name],0),\"\")=\"\",\"\",LOOKUP(B19,taxonpath[scientific_name],taxonpath[aphia_id])))","v":""}]
[{"$f":"IF(B20=\"\",\"\",IF(_xlfn.IFNA(MATCH(B20,taxonpath[scientific_name],0),\"\")=\"\",\"\",LOOKUP(B20,taxonpath[scientific_name],taxonpath[aphia_id])))","v":""}]
{"$rows_left_out":347}
{"sheet":"dropdown","index":8,"n_rows":68,"n_cols":62,"rows_kept":68,"cut":false,"hidden":false,"merged":[]}
["alioki_nr","alifjord_nr",null,"djornogd_id","djornogd_navn",null,"botnheint_id","botnheint_navn",null,"eind_id","eind_navn",null,"evjutjugd_id","evjutjugd_navn",null,"evni_id","evni_navn",null,"fastleiki_id","fastleiki_navn",null,"grabbanogd_id","grabbanogd_navn",null,"janei_id","janei_navn",null,"kfelag_id","kfelag_navn",null,"kfolk_id","kfolk_navn",null,"litur_id","litur_navn",null,"luktur_id","luktur_navn",null,"stoda_id","stoda_navn",null,"stodslag_id","stodslag_navn",null,"upptalt_id","upptalt_navn",null,"utgavuslag_id","utgavuslag_navn",null,"basis","basis_navn",null,"qflag","qflag_navn",null,"met_matiovissa","met_matiovissa_navn",null,"starvsstova","starvsstova_navn"]
["A08","",null,"U5","undir 5 (< 5)",null,"HAPS","Haps",null,"ugkg","ug/kg",null,"T02","0 - 2 cm",null,"ZN","Zink",null,"BLE","bleytt",null,"V0025","< 0.25",null,"j","ja",null,"BIOF","Biofar",null,"AN","Ámundur Nolsøe",null,"BS","brúnur/svartur",null,"EIN","eingin",null,"s1","Støða 1",null,"FS","Fjarðasýni",null,"FULT","fult upptalt",null,"TRAPP","Teknisk rapport",null,"D","Turrvekt (Dry Weight)",null,"<","minni enn",null,"%","percet óvissa",null,"HFSF","Heilsufrøðiliga Starvsstovan"]
["A53","C-8",null,"Y5","yvir 5 (> 5)",null,"HAPSK","Haps kajak",null,"ugg","ug/g",null,"T28","2 - 8 cm",null,"LOI","Loss of ignition",null,"FAST","fast",null,"V2575","0.25 - 0.75",null,"n","nei",null,null,null,null,"JKB","Jákup Kristian Bærensten",null,"LG","ljósur/gráur",null,"NAK","nakað",null,"s2","Støða 2",null,"OO","Ókent",null,"EINKI","ikki upptalt",null,"VISGR","Vísindalig grein (peer reviewed)",null,"W","Vátvekt (Wet/fresh weight)",null,">","meira enn",null,"SD","Standard deviation (+/-)",null,"EFD","Eurofins Danmark"]
["A39","C-20",null,"NN","einki (0)",null,"HAPSS","Haps stórur",null,"mgkg","mg/kg",null,"T80","> 8 cm",null,"TOC","Total Organic Carbon (TOC)",null,"HBLE","hálvbleytt",null,"V7510","> 0.75",null,null,null,null,null,null,null,"RJ","Regin Joensen",null,null,null,null,"RAM","ramur",null,"s3","Støða 3",null,"RS","Ringsýni",null,"TIL20","talt upp til 20 sløg",null,"OKENT","ókent",null,"L","Feittvekt (Lipid weight)",null,null,null,null,null,null,null,"EFG","Eurofins Germany"]
["NA","",null,null,null,null,"MCI","Grabbi McIntyre",null,"mgg","mg/g",null,null,null,null,"NTOT","Total Nitrogen (N)",null,null,null,null,null,null,null,null,null,null,null,null,null,"BVT","Birna V. Trúgvadóttir",null,null,null,null,null,null,null,"s4","Støða 4",null,"SS","Samanberingarsýni",null,"OKENT","ókent, ber ikki til at siga út frá frágreiðingini",null,"UNDAN","Undan kanning",null,null,null,null,null,null,null,null,null,null,"NIVA","Norwegian Institute for Water Research"]
["OO","",null,null,null,null,"VV","Grabbi Van Veen",null,"%","percent %",null,null,null,null,"PTOT","Total Phosphorus (P)",null,null,null,null,null,null,null,null,null,null,null,null,null,"HA","Høgni Arnbjarnarson",null,null,null,null,null,null,null,null,null,null,"OS","Økissýni",null,null,null,null,"ALIAU","Aling - áðrenn útsetu",null,null,null,null,null,null,null,null,null,null,"ALS","ALS Scandinavia"]
["A25","C-10",null,null,null,null,"GOK","Grabbi ókent slag",null,"gkg","g/kg",null,null,null,null,"AL","Aluminium",null,null,null,null,null,null,null,null,null,null,null,null,null,"JFH","Jógvan Fróði Hansen",null,null,null,null,null,null,null,null,null,null,null,null,null,null,null,null,"ALIMK","Aling - millum kanning"]
["A47","C-10",null,null,null,null,"OKENT","ókent",null,null,null,null,null,null,null,"HG","Merqury",null,null,null,null,null,null,null,null,null,null,null,null,null,"KP","Kári Purkhús",null,null,null,null,null,null,null,null,null,null,null,null,null,null,null,null,"ALISB","Aling - størsta biomassa"]
["A05","C-14 / F-3",null,null,null,null,"GST","Grabbi stál",null,null,null,null,null,null,null,"DRYWT","Dry Weight Percentage",null,null,null,null,null,null,null,null,null,null,null,null,null,"HG","Heidi Gregersen",null,null,null,null,null,null,null,null,null,null,null,null,null,null,null,null,"UMKAL","Umhvørviskanning av aliøki - ódefinera"]
["A81","C-14 / F-3",null,null,null,null,"GBL","Grabbi bláur",null,null,null,null,null,null,null,"CU","Copper",null,null,null,null,null,null,null,null,null,null,null,null,null,"SJS","Sámal Jákup Sakariasson"]
["A85","C-14 / F-3",null,null,null,null,"KCDGD","KC-Danmark grabbi, av Day slagnum ",null,null,null,null,null,null,null,"GR","",null,null,null,null,null,null,null,null,null,null,null,null,null,"SC","Súni Christiansen"]
["A07","C-18",null,null,null,null,null,null,null,null,null,null,null,null,null,null,null,null,null,null,null,null,null,null,null,null,null,null,null,null,"GD","Guttormur Djurhuus"]
["A09","C-20",null,null,null,null,null,null,null,null,null,null,null,null,null,null,null,null,null,null,null,null,null,null,null,null,null,null,null,null,"JS","Jan Sørensen"]
["A20","C-23",null,null,null,null,null,null,null,null,null,null,null,null,null,null,null,null,null,null,null,null,null,null,null,null,null,null,null,null,"JJ","Jana Jacobsen"]
["A30","C-23",null,null,null,null,null,null,null,null,null,null,null,null,null,null,null,null,null,null,null,null,null,null,null,null,null,null,null,null,"HJ","Hjalgrím"]
["A31","C-13",null,null,null,null,null,null,null,null,null,null,null,null,null,null,null,null,null,null,null,null,null,null,null,null,null,null,null,null,"KH","Katrin Hoydal"]
["A33","C-12",null,null,null,null,null,null,null,null,null,null,null,null,null,null,null,null,null,null,null,null,null,null,null,null,null,null,null,null,"AGD","?"]
["A34","G-1",null,null,null,null,null,null,null,null,null,null,null,null,null,null,null,null,null,null,null,null,null,null,null,null,null,null,null,null,"AV","Áki Vang"]
["A37","C-18",null,null,null,null,null,null,null,null,null,null,null,null,null,null,null,null,null,null,null,null,null,null,null,null,null,null,null,null,"LMJ","Laura Mary Jacobsen"]
["A69","C-18",null,null,null,null,null,null,null,null,null,null,null,null,null,null,null,null,null,null,null,null,null,null,null,null,null,null,null,null,"HCP",""]
{"$rows_left_out":49}
{"sheet":"talvur","index":9,"n_rows":79,"n_cols":5,"rows_kept":79,"cut":false,"hidden":false,"merged":[]}
["BotnID",null,"DjorlivID",null,"GIStype"]
[{"$f":"IFERROR(INDEX(BotnSyni!$A$2:$A$99, SMALL(IF(BotnSyni!$A$2:$A$99<>\"\", ROW(BotnSyni!$A$1:$A$98)),ROW(BotnSyni!A1))),\"\")","v":""},null,{"$f":"IFERROR(INDEX(DjorlivSyni!$A$2:$A$99, SMALL(IF(DjorlivSyni!$A$2:$A$99<>\"\", ROW(DjorlivSyni!$A$1:$A$98)),ROW(DjorlivSyni!C1))),\"\")","v":""},null,"decimal"]
[{"$f":"IFERROR(INDEX(BotnSyni!$A$2:$A$99, SMALL(IF(BotnSyni!$A$2:$A$99<>\"\", ROW(BotnSyni!$A$1:$A$98)),ROW(BotnSyni!A2))),\"\")","v":""},null,{"$f":"IFERROR(INDEX(DjorlivSyni!$A$2:$A$99, SMALL(IF(DjorlivSyni!$A$2:$A$99<>\"\", ROW(DjorlivSyni!$A$1:$A$98)),ROW(DjorlivSyni!C2))),\"\")","v":""},null,"deg min"]
[{"$f":"IFERROR(INDEX(BotnSyni!$A$2:$A$99, SMALL(IF(BotnSyni!$A$2:$A$99<>\"\", ROW(BotnSyni!$A$1:$A$98)),ROW(BotnSyni!A3))),\"\")","v":""},null,{"$f":"IFERROR(INDEX(DjorlivSyni!$A$2:$A$99, SMALL(IF(DjorlivSyni!$A$2:$A$99<>\"\", ROW(DjorlivSyni!$A$1:$A$98)),ROW(DjorlivSyni!C3))),\"\")","v":""}]
[{"$f":"IFERROR(INDEX(BotnSyni!$A$2:$A$99, SMALL(IF(BotnSyni!$A$2:$A$99<>\"\", ROW(BotnSyni!$A$1:$A$98)),ROW(BotnSyni!A4))),\"\")","v":""},null,{"$f":"IFERROR(INDEX(DjorlivSyni!$A$2:$A$99, SMALL(IF(DjorlivSyni!$A$2:$A$99<>\"\", ROW(DjorlivSyni!$A$1:$A$98)),ROW(DjorlivSyni!C4))),\"\")","v":""}]
[{"$f":"IFERROR(INDEX(BotnSyni!$A$2:$A$99, SMALL(IF(BotnSyni!$A$2:$A$99<>\"\", ROW(BotnSyni!$A$1:$A$98)),ROW(BotnSyni!A5))),\"\")","v":""},null,{"$f":"IFERROR(INDEX(DjorlivSyni!$A$2:$A$99, SMALL(IF(DjorlivSyni!$A$2:$A$99<>\"\", ROW(DjorlivSyni!$A$1:$A$98)),ROW(DjorlivSyni!C5))),\"\")","v":""}]
[{"$f":"IFERROR(INDEX(BotnSyni!$A$2:$A$99, SMALL(IF(BotnSyni!$A$2:$A$99<>\"\", ROW(BotnSyni!$A$1:$A$98)),ROW(BotnSyni!A6))),\"\")","v":""},null,{"$f":"IFERROR(INDEX(DjorlivSyni!$A$2:$A$99, SMALL(IF(DjorlivSyni!$A$2:$A$99<>\"\", ROW(DjorlivSyni!$A$1:$A$98)),ROW(DjorlivSyni!C6))),\"\")","v":""}]
[{"$f":"IFERROR(INDEX(BotnSyni!$A$2:$A$99, SMALL(IF(BotnSyni!$A$2:$A$99<>\"\", ROW(BotnSyni!$A$1:$A$98)),ROW(BotnSyni!A7))),\"\")","v":""},null,{"$f":"IFERROR(INDEX(DjorlivSyni!$A$2:$A$99, SMALL(IF(DjorlivSyni!$A$2:$A$99<>\"\", ROW(DjorlivSyni!$A$1:$A$98)),ROW(DjorlivSyni!C7))),\"\")","v":""}]
[{"$f":"IFERROR(INDEX(BotnSyni!$A$2:$A$99, SMALL(IF(BotnSyni!$A$2:$A$99<>\"\", ROW(BotnSyni!$A$1:$A$98)),ROW(BotnSyni!A8))),\"\")","v":""},null,{"$f":"IFERROR(INDEX(DjorlivSyni!$A$2:$A$99, SMALL(IF(DjorlivSyni!$A$2:$A$99<>\"\", ROW(DjorlivSyni!$A$1:$A$98)),ROW(DjorlivSyni!C8))),\"\")","v":""}]
[{"$f":"IFERROR(INDEX(BotnSyni!$A$2:$A$99, SMALL(IF(BotnSyni!$A$2:$A$99<>\"\", ROW(BotnSyni!$A$1:$A$98)),ROW(BotnSyni!A9))),\"\")","v":""},null,{"$f":"IFERROR(INDEX(DjorlivSyni!$A$2:$A$99, SMALL(IF(DjorlivSyni!$A$2:$A$99<>\"\", ROW(DjorlivSyni!$A$1:$A$98)),ROW(DjorlivSyni!C9))),\"\")","v":""}]
[{"$f":"IFERROR(INDEX(BotnSyni!$A$2:$A$99, SMALL(IF(BotnSyni!$A$2:$A$99<>\"\", ROW(BotnSyni!$A$1:$A$98)),ROW(BotnSyni!A10))),\"\")","v":""},null,{"$f":"IFERROR(INDEX(DjorlivSyni!$A$2:$A$99, SMALL(IF(DjorlivSyni!$A$2:$A$99<>\"\", ROW(DjorlivSyni!$A$1:$A$98)),ROW(DjorlivSyni!C10))),\"\")","v":""}]
[{"$f":"IFERROR(INDEX(BotnSyni!$A$2:$A$99, SMALL(IF(BotnSyni!$A$2:$A$99<>\"\", ROW(BotnSyni!$A$1:$A$98)),ROW(BotnSyni!A11))),\"\")","v":""},null,{"$f":"IFERROR(INDEX(DjorlivSyni!$A$2:$A$99, SMALL(IF(DjorlivSyni!$A$2:$A$99<>\"\", ROW(DjorlivSyni!$A$1:$A$98)),ROW(DjorlivSyni!C11))),\"\")","v":""}]
[{"$f":"IFERROR(INDEX(BotnSyni!$A$2:$A$99, SMALL(IF(BotnSyni!$A$2:$A$99<>\"\", ROW(BotnSyni!$A$1:$A$98)),ROW(BotnSyni!A12))),\"\")","v":""},null,{"$f":"IFERROR(INDEX(DjorlivSyni!$A$2:$A$99, SMALL(IF(DjorlivSyni!$A$2:$A$99<>\"\", ROW(DjorlivSyni!$A$1:$A$98)),ROW(DjorlivSyni!C12))),\"\")","v":""}]
[{"$f":"IFERROR(INDEX(BotnSyni!$A$2:$A$99, SMALL(IF(BotnSyni!$A$2:$A$99<>\"\", ROW(BotnSyni!$A$1:$A$98)),ROW(BotnSyni!A13))),\"\")","v":""},null,{"$f":"IFERROR(INDEX(DjorlivSyni!$A$2:$A$99, SMALL(IF(DjorlivSyni!$A$2:$A$99<>\"\", ROW(DjorlivSyni!$A$1:$A$98)),ROW(DjorlivSyni!C13))),\"\")","v":""}]
[{"$f":"IFERROR(INDEX(BotnSyni!$A$2:$A$99, SMALL(IF(BotnSyni!$A$2:$A$99<>\"\", ROW(BotnSyni!$A$1:$A$98)),ROW(BotnSyni!A14))),\"\")","v":""},null,{"$f":"IFERROR(INDEX(DjorlivSyni!$A$2:$A$99, SMALL(IF(DjorlivSyni!$A$2:$A$99<>\"\", ROW(DjorlivSyni!$A$1:$A$98)),ROW(DjorlivSyni!C14))),\"\")","v":""}]
[{"$f":"IFERROR(INDEX(BotnSyni!$A$2:$A$99, SMALL(IF(BotnSyni!$A$2:$A$99<>\"\", ROW(BotnSyni!$A$1:$A$98)),ROW(BotnSyni!A15))),\"\")","v":""},null,{"$f":"IFERROR(INDEX(DjorlivSyni!$A$2:$A$99, SMALL(IF(DjorlivSyni!$A$2:$A$99<>\"\", ROW(DjorlivSyni!$A$1:$A$98)),ROW(DjorlivSyni!C15))),\"\")","v":""}]
[{"$f":"IFERROR(INDEX(BotnSyni!$A$2:$A$99, SMALL(IF(BotnSyni!$A$2:$A$99<>\"\", ROW(BotnSyni!$A$1:$A$98)),ROW(BotnSyni!A16))),\"\")","v":""},null,{"$f":"IFERROR(INDEX(DjorlivSyni!$A$2:$A$99, SMALL(IF(DjorlivSyni!$A$2:$A$99<>\"\", ROW(DjorlivSyni!$A$1:$A$98)),ROW(DjorlivSyni!C16))),\"\")","v":""}]
[{"$f":"IFERROR(INDEX(BotnSyni!$A$2:$A$99, SMALL(IF(BotnSyni!$A$2:$A$99<>\"\", ROW(BotnSyni!$A$1:$A$98)),ROW(BotnSyni!A17))),\"\")","v":""}]
[{"$f":"IFERROR(INDEX(BotnSyni!$A$2:$A$99, SMALL(IF(BotnSyni!$A$2:$A$99<>\"\", ROW(BotnSyni!$A$1:$A$98)),ROW(BotnSyni!A18))),\"\")","v":""}]
[{"$f":"IFERROR(INDEX(BotnSyni!$A$2:$A$99, SMALL(IF(BotnSyni!$A$2:$A$99<>\"\", ROW(BotnSyni!$A$1:$A$98)),ROW(BotnSyni!A19))),\"\")","v":""}]
{"$rows_left_out":60}
{"sheet":"taxonpath","index":10,"n_rows":1035,"n_cols":4,"rows_kept":1035,"cut":false,"hidden":false,"merged":[]}
["aphia_id","ancestors","rankname","scientific_name"]
[138474,"{Animalia,Mollusca,Bivalvia,Cardiida,Semelidae,Abra}","genus","Abra"]
[141433,"{Animalia,Mollusca,Bivalvia,Cardiida,Semelidae,Abra,\"Abra alba\"}","species","Abra alba"]
[141435,"{Animalia,Mollusca,Bivalvia,Cardiida,Semelidae,Abra,\"Abra nitida\"}","species","Abra nitida"]
[141436,"{Animalia,Mollusca,Bivalvia,Cardiida,Semelidae,Abra,\"Abra prismatica\"}","species","Abra prismatica"]
[137732,"{Animalia,Mollusca,Bivalvia,Cardiida,Cardiidae,Acanthocardia}","genus","Acanthocardia"]
[138990,"{Animalia,Mollusca,Bivalvia,Cardiida,Cardiidae,Acanthocardia,\"Acanthocardia aculeata\"}","species","Acanthocardia aculeata"]
[138992,"{Animalia,Mollusca,Bivalvia,Cardiida,Cardiidae,Acanthocardia,\"Acanthocardia echinata\"}","species","Acanthocardia echinata"]
[292684,"{Animalia,Arthropoda,Arachnida,Acari}","subclass","Acari"]
[137614,"{Animalia,Mollusca,Gastropoda,Littorinimorpha,Eulimidae,Aclis}","genus","Aclis"]
[267197,"{Animalia,Cnidaria,Anthozoa,Actiniaria,Thalassianthidae,Actineria}","genus","Actineria"]
[1360,"{Animalia,Cnidaria,Anthozoa,Actiniaria}","order","Actiniaria"]
[10194,"{Animalia,Chordata,Actinopterygii}","class","Actinopterygii"]
[869601,"{Animalia,Mollusca,Bivalvia,Adapedonta}","order","Adapedonta"]
[138313,"{Animalia,Mollusca,Bivalvia,Pectinida,Pectinidae,Aequipecten}","genus","Aequipecten"]
[140687,"{Animalia,Mollusca,Bivalvia,Pectinida,Pectinidae,Aequipecten,\"Aequipecten opercularis\"}","species","Aequipecten opercularis"]
[129366,"{Animalia,Annelida,Polychaeta,Phyllodocida,Nephtyidae,Aglaophamus}","genus","Aglaophamus"]
[130343,"{Animalia,Annelida,Polychaeta,Phyllodocida,Nephtyidae,Aglaophamus,\"Aglaophamus agilis\"}","species","Aglaophamus agilis"]
[130345,"{Animalia,Annelida,Polychaeta,Phyllodocida,Nephtyidae,Aglaophamus,\"Aglaophamus rubella\"}","species","Aglaophamus rubella"]
[599405,"{Animalia,Arthropoda,Crustacea,Malacostraca,Tanaidacea,Akanthophoreidae}","family","Akanthophoreidae"]
{"$rows_left_out":1016}
{"sheet":"version","index":11,"n_rows":2,"n_cols":1,"rows_kept":2,"cut":false,"hidden":false,"merged":[]}
["version av inntøppingar skjali"]
["v1.0"]